RenPy中文空间

 找回密码
 立即注册

QQ登录

只需一步,快速开始

查看: 89|回复: 0

[求助] 打包安卓构建失败

[复制链接]
发表于 2022-9-19 19:01:03 | 显示全部楼层 |阅读模式

马上注册,结交更多好友,享用更多功能,让你轻松玩转社区。

您需要 登录 才可以下载或查看,没有账号?立即注册

x



Ren'Py 7.5.3.22090809

正在更新项目。

正在创建资源目录。

正在打包内部数据。

正在使用 Gradle 构建应用包。
To honour the JVM settings for this build a new JVM will be forked. Please consider using the daemon: https://docs.gradle.org/6.1.1/userguide/gradle_daemon.html.
Daemon will be stopped at the end of the build stopping after processing
Warning: Mapping new ns http://schemas.android.com/repository/android/common/02 to old ns http://schemas.android.com/repository/android/common/01
Warning: Mapping new ns http://schemas.android.com/repository/android/generic/02 to old ns http://schemas.android.com/repository/android/generic/01
Warning: Mapping new ns http://schemas.android.com/sdk/android/repo/addon2/02 to old ns http://schemas.android.com/sdk/android/repo/addon2/01
Warning: Mapping new ns http://schemas.android.com/sdk/android/repo/repository2/02 to old ns http://schemas.android.com/sdk/android/repo/repository2/01
Warning: Mapping new ns http://schemas.android.com/sdk/android/repo/sys-img2/02 to old ns http://schemas.android.com/sdk/android/repo/sys-img2/01
> Task :app:preBuild UP-TO-DATE
> Task :app:preReleaseBuild UP-TO-DATE
> Task :renpyandroid:preBuild UP-TO-DATE
> Task :renpyandroid:preReleaseBuild UP-TO-DATE
> Task :renpyandroid:compileReleaseAidl NO-SOURCE
> Task :renpyiap:preBuild UP-TO-DATE
> Task :renpyiap:preReleaseBuild UP-TO-DATE
> Task :renpyiap:compileReleaseAidl NO-SOURCE
> Task :app:compileReleaseAidl NO-SOURCE
> Task :renpyandroid:packageReleaseRenderscript NO-SOURCE
> Task :renpyiap:packageReleaseRenderscript NO-SOURCE
> Task :app:compileReleaseRenderscript NO-SOURCE
> Task :app:generateReleaseBuildConfig
> Task :app:javaPreCompileRelease UP-TO-DATE
> Task :app:generateReleaseResValues UP-TO-DATE
> Task :app:generateReleaseResources UP-TO-DATE
> Task :renpyandroid:compileReleaseRenderscript NO-SOURCE
> Task :renpyandroid:generateReleaseResValues UP-TO-DATE
> Task :renpyandroid:generateReleaseResources UP-TO-DATE
> Task :renpyandroid:packageReleaseResources UP-TO-DATE
> Task :renpyiap:compileReleaseRenderscript NO-SOURCE
> Task :renpyiap:generateReleaseResValues UP-TO-DATE
> Task :renpyiap:generateReleaseResources UP-TO-DATE
> Task :renpyiap:packageReleaseResources UP-TO-DATE
> Task :app:createReleaseCompatibleScreenManifests
> Task :app:extractDeepLinksRelease UP-TO-DATE
> Task :renpyandroid:extractDeepLinksRelease UP-TO-DATE
> Task :renpyandroid:processReleaseManifest UP-TO-DATE
> Task :renpyiap:extractDeepLinksRelease UP-TO-DATE
> Task :renpyiap:processReleaseManifest UP-TO-DATE
> Task :app:processReleaseManifest
> Task :renpyandroid:compileReleaseLibraryResources UP-TO-DATE
> Task :renpyandroid:parseReleaseLocalResources UP-TO-DATE
> Task :renpyandroid:generateReleaseRFile UP-TO-DATE
> Task :renpyiap:compileReleaseLibraryResources UP-TO-DATE
> Task :renpyiap:parseReleaseLocalResources UP-TO-DATE
> Task :renpyiap:generateReleaseRFile UP-TO-DATE
> Task :renpyandroid:generateReleaseBuildConfig UP-TO-DATE
> Task :renpyandroid:javaPreCompileRelease UP-TO-DATE
> Task :renpyandroid:compileReleaseJavaWithJavac UP-TO-DATE
> Task :renpyandroid:bundleLibCompileToJarRelease UP-TO-DATE
> Task :renpyiap:generateReleaseBuildConfig UP-TO-DATE
> Task :renpyiap:javaPreCompileRelease UP-TO-DATE
> Task :renpyiap:compileReleaseJavaWithJavac UP-TO-DATE
> Task :renpyiap:bundleLibCompileToJarRelease UP-TO-DATE
> Task :app:mergeReleaseResources
aapt2.exe W 09-19 18:54:58  3272  7512 LoadedArsc.cpp:657] Unknown chunk type '200'.

> Task :app:processReleaseResources
> Task :app:compileReleaseJavaWithJavac
> Task :app:compileReleaseSources
> Task :app:prepareLintJar UP-TO-DATE
> Task :renpyandroid:prepareLintJarForPublish UP-TO-DATE
> Task :renpyiap:prepareLintJarForPublish UP-TO-DATE
> Task :app:lintVitalRelease
> Task :renpyiap:bundleLibRuntimeToJarRelease UP-TO-DATE
> Task :renpyandroid:bundleLibRuntimeToJarRelease UP-TO-DATE
> Task :app:dexBuilderRelease
> Task :app:checkReleaseDuplicateClasses UP-TO-DATE
> Task :app:mergeExtDexRelease UP-TO-DATE
> Task :app:mergeReleaseShaders UP-TO-DATE
> Task :app:compileReleaseShaders NO-SOURCE
> Task :app:generateReleaseAssets UP-TO-DATE
> Task :renpyandroid:mergeReleaseShaders UP-TO-DATE
> Task :renpyandroid:compileReleaseShaders NO-SOURCE
> Task :renpyandroid:generateReleaseAssets UP-TO-DATE
> Task :renpyandroid:packageReleaseAssets UP-TO-DATE
> Task :renpyiap:mergeReleaseShaders UP-TO-DATE
> Task :renpyiap:compileReleaseShaders NO-SOURCE
> Task :renpyiap:generateReleaseAssets UP-TO-DATE
> Task :renpyiap:packageReleaseAssets UP-TO-DATE
> Task :app:mergeReleaseAssets
> Task :app:mergeDexRelease
> Task :app:processReleaseJavaRes NO-SOURCE
> Task :renpyandroid:processReleaseJavaRes NO-SOURCE
> Task :renpyandroid:bundleLibResRelease NO-SOURCE
> Task :renpyiap:processReleaseJavaRes NO-SOURCE
> Task :renpyiap:bundleLibResRelease NO-SOURCE
> Task :app:mergeReleaseJavaResource UP-TO-DATE
> Task :app:collectReleaseDependencies UP-TO-DATE
> Task :app:sdkReleaseDependencyData UP-TO-DATE
> Task :app:mergeReleaseJniLibFolders UP-TO-DATE
> Task :renpyandroid:mergeReleaseJniLibFolders UP-TO-DATE
> Task :renpyandroid:mergeReleaseNativeLibs UP-TO-DATE

> Task :renpyandroid:stripReleaseDebugSymbols UP-TO-DATE
WARNING: Compatible side by side NDK version was not found for android.ndkVersion '21.3.6528147'
Compatible side by side NDK version was not found for android.ndkVersion '21.3.6528147'

> Task :renpyandroid:copyReleaseJniLibsProjectOnly UP-TO-DATE
> Task :renpyiap:mergeReleaseJniLibFolders UP-TO-DATE
> Task :renpyiap:mergeReleaseNativeLibs UP-TO-DATE
> Task :renpyiap:stripReleaseDebugSymbols NO-SOURCE
> Task :renpyiap:copyReleaseJniLibsProjectOnly UP-TO-DATE
> Task :app:mergeReleaseNativeLibs UP-TO-DATE

> Task :app:stripReleaseDebugSymbols UP-TO-DATE
WARNING: Compatible side by side NDK version was not found for android.ndkVersion '21.3.6528147'
Compatible side by side NDK version was not found for android.ndkVersion '21.3.6528147'

> Task :app:validateSigningRelease UP-TO-DATE
> Task :app:packageRelease
> Task :app:packageRelease FAILED

FAILURE: Build failed with an exception.

* What went wrong:
Execution failed for task ':app:packageRelease'.
> A failure occurred while executing com.android.build.gradle.internal.tasks.Workers$ActionFacade
   > value (4298347896) > 0x00000000ffffffffL

* Try:
Run with --stacktrace option to get the stack trace. Run with --info or --debug option to get more log output. Run with --scan to get full insights.

* Get more help at https://help.gradle.org

BUILD FAILED in 3m 56s
62 actionable tasks: 11 executed, 51 up-to-date




构建似乎已失败。


有大佬帮下小弟吗,一直打包不了,renpy也换了好几个版本,还是不行
您需要登录后才可以回帖 登录 | 立即注册

本版积分规则

小黑屋|手机版|RenPy中文空间 ( 苏ICP备17067825号 | 苏公网安备 32092302000068号 )

GMT+8, 2022-10-3 01:00 , Processed in 0.043506 second(s), 19 queries , File On.

Powered by Discuz! X3.4 Licensed

Copyright © 2001-2021, Tencent Cloud.

快速回复 返回顶部 返回列表