RenPy中文空间

 找回密码
 立即注册

QQ登录

只需一步,快速开始

查看: 389|回复: 2

[有回复] 打包apk错误

[复制链接]
发表于 2020-3-18 17:10:33 | 显示全部楼层 |阅读模式

马上注册,结交更多好友,享用更多功能,让你轻松玩转社区。

您需要 登录 才可以下载或查看,没有帐号?立即注册

x
Ren'Py 7.3.5.606

Updating project.

Creating assets directory.

Packaging internal data.

I'm using Gradle to build the package.
Starting a Gradle Daemon, 1 incompatible and 3 stopped Daemons could not be reused, use --status for details
:app:preBuild UP-TO-DATE
:renpyandroid:preBuild UP-TO-DATE
:renpyandroid:preReleaseBuild UP-TO-DATE
:renpyandroid:checkReleaseManifest UP-TO-DATE
:renpyandroid:processReleaseManifest UP-TO-DATE
:app:preReleaseBuild UP-TO-DATE
:renpyandroid:compileReleaseAidl UP-TO-DATE
:app:compileReleaseAidl UP-TO-DATE
:renpyandroid:packageReleaseRenderscript NO-SOURCE
:app:compileReleaseRenderscript UP-TO-DATE
:app:checkReleaseManifest UP-TO-DATE
:app:generateReleaseBuildConfig UP-TO-DATE
:app:prepareLintJar UP-TO-DATE
:app:mainApkListPersistenceRelease UP-TO-DATE
:app:generateReleaseResValues UP-TO-DATE
:app:generateReleaseResources UP-TO-DATE
:renpyandroid:compileReleaseRenderscript UP-TO-DATE
:renpyandroid:generateReleaseResValues UP-TO-DATE
:renpyandroid:generateReleaseResources UP-TO-DATE
:renpyandroid:packageReleaseResources UP-TO-DATE
:app:mergeReleaseResources UP-TO-DATE
:app:createReleaseCompatibleScreenManifests UP-TO-DATE
:app:processReleaseManifest UP-TO-DATE
:app:splitsDiscoveryTaskRelease UP-TO-DATE
:renpyandroid:platformAttrExtractor UP-TO-DATE
:renpyandroid:generateReleaseRFile UP-TO-DATE
:app:processReleaseResources UP-TO-DATE
:app:generateReleaseSources UP-TO-DATE
:renpyandroid:generateReleaseBuildConfig UP-TO-DATE
:renpyandroid:prepareLintJar UP-TO-DATE
:renpyandroid:generateReleaseSources UP-TO-DATE
:renpyandroid:javaPreCompileRelease UP-TO-DATE
:renpyandroid:compileReleaseJavaWithJavac UP-TO-DATE
:renpyandroid:processReleaseJavaRes NO-SOURCE
:renpyandroid:transformClassesAndResourcesWithPrepareIntermediateJarsForRelease UP-TO-DATE
:app:javaPreCompileRelease UP-TO-DATE
:app:compileReleaseJavaWithJavac UP-TO-DATE
:app:compileReleaseNdk NO-SOURCE
:app:compileReleaseSources UP-TO-DATE
:app:lintVitalRelease
:app:mergeReleaseShaders UP-TO-DATE
:app:compileReleaseShaders UP-TO-DATE
:app:generateReleaseAssets UP-TO-DATE
:renpyandroid:mergeReleaseShaders UP-TO-DATE
:renpyandroid:compileReleaseShaders UP-TO-DATE
:renpyandroid:generateReleaseAssets UP-TO-DATE
:renpyandroid:packageReleaseAssets UP-TO-DATE
:app:mergeReleaseAssets
:app:transformClassesWithDexBuilderForRelease UP-TO-DATE
:app:transformDexArchiveWithExternalLibsDexMergerForRelease UP-TO-DATE
:app:transformDexArchiveWithDexMergerForRelease UP-TO-DATE
:app:mergeReleaseJniLibFolders UP-TO-DATE
:renpyandroid:compileReleaseNdk NO-SOURCE
:renpyandroid:mergeReleaseJniLibFolders UP-TO-DATE
:renpyandroid:transformNativeLibsWithMergeJniLibsForRelease UP-TO-DATE
:renpyandroid:transformNativeLibsWithIntermediateJniLibsForRelease UP-TO-DATE
:app:transformNativeLibsWithMergeJniLibsForRelease UP-TO-DATE
:app:processReleaseJavaRes NO-SOURCE
:app:transformResourcesWithMergeJavaResForRelease UP-TO-DATE
:app:validateSigningRelease UP-TO-DATE
:app:packageRelease FAILED

FAILURE: Build failed with an exception.

* What went wrong:
Execution failed for task ':app:packageRelease'.
> Execution of compression failed.

* Try:
Run with --info or --debug option to get more log output. Run with --scan to get full insights.

* Exception is:
org.gradle.api.tasks.TaskExecutionException: Execution failed for task ':app:packageRelease'.
        at org.gradle.api.internal.tasks.execution.ExecuteActionsTaskExecuter.executeActions(ExecuteActionsTaskExecuter.java:100)
        at org.gradle.api.internal.tasks.execution.ExecuteActionsTaskExecuter.execute(ExecuteActionsTaskExecuter.java:70)
        at org.gradle.api.internal.tasks.execution.OutputDirectoryCreatingTaskExecuter.execute(OutputDirectoryCreatingTaskExecuter.java:51)
        at org.gradle.api.internal.tasks.execution.SkipUpToDateTaskExecuter.execute(SkipUpToDateTaskExecuter.java:62)
        at org.gradle.api.internal.tasks.execution.ResolveTaskOutputCachingStateExecuter.execute(ResolveTaskOutputCachingStateExecuter.java:54)
        at org.gradle.api.internal.tasks.execution.ValidatingTaskExecuter.execute(ValidatingTaskExecuter.java:60)
        at org.gradle.api.internal.tasks.execution.SkipEmptySourceFilesTaskExecuter.execute(SkipEmptySourceFilesTaskExecuter.java:97)
        at org.gradle.api.internal.tasks.execution.CleanupStaleOutputsExecuter.execute(CleanupStaleOutputsExecuter.java:87)
        at org.gradle.api.internal.tasks.execution.ResolveTaskArtifactStateTaskExecuter.execute(ResolveTaskArtifactStateTaskExecuter.java:52)
        at org.gradle.api.internal.tasks.execution.SkipTaskWithNoActionsExecuter.execute(SkipTaskWithNoActionsExecuter.java:52)
        at org.gradle.api.internal.tasks.execution.SkipOnlyIfTaskExecuter.execute(SkipOnlyIfTaskExecuter.java:54)
        at org.gradle.api.internal.tasks.execution.ExecuteAtMostOnceTaskExecuter.execute(ExecuteAtMostOnceTaskExecuter.java:43)
        at org.gradle.api.internal.tasks.execution.CatchExceptionTaskExecuter.execute(CatchExceptionTaskExecuter.java:34)
        at org.gradle.execution.taskgraph.DefaultTaskGraphExecuter$EventFiringTaskWorker$1.run(DefaultTaskGraphExecuter.java:248)
        at org.gradle.internal.progress.DefaultBuildOperationExecutor$RunnableBuildOperationWorker.execute(DefaultBuildOperationExecutor.java:336)
        at org.gradle.internal.progress.DefaultBuildOperationExecutor$RunnableBuildOperationWorker.execute(DefaultBuildOperationExecutor.java:328)
        at org.gradle.internal.progress.DefaultBuildOperationExecutor.execute(DefaultBuildOperationExecutor.java:199)
        at org.gradle.internal.progress.DefaultBuildOperationExecutor.run(DefaultBuildOperationExecutor.java:110)
        at org.gradle.execution.taskgraph.DefaultTaskGraphExecuter$EventFiringTaskWorker.execute(DefaultTaskGraphExecuter.java:241)
        at org.gradle.execution.taskgraph.DefaultTaskGraphExecuter$EventFiringTaskWorker.execute(DefaultTaskGraphExecuter.java:230)
        at org.gradle.execution.taskgraph.DefaultTaskPlanExecutor$TaskExecutorWorker.processTask(DefaultTaskPlanExecutor.java:123)
        at org.gradle.execution.taskgraph.DefaultTaskPlanExecutor$TaskExecutorWorker.access$200(DefaultTaskPlanExecutor.java:79)
        at org.gradle.execution.taskgraph.DefaultTaskPlanExecutor$TaskExecutorWorker$1.execute(DefaultTaskPlanExecutor.java:104)
        at org.gradle.execution.taskgraph.DefaultTaskPlanExecutor$TaskExecutorWorker$1.execute(DefaultTaskPlanExecutor.java:98)
        at org.gradle.execution.taskgraph.DefaultTaskExecutionPlan.execute(DefaultTaskExecutionPlan.java:626)
        at org.gradle.execution.taskgraph.DefaultTaskExecutionPlan.executeWithTask(DefaultTaskExecutionPlan.java:581)
        at org.gradle.execution.taskgraph.DefaultTaskPlanExecutor$TaskExecutorWorker.run(DefaultTaskPlanExecutor.java:98)
        at org.gradle.internal.concurrent.ExecutorPolicy$CatchAndRecordFailures.onExecute(ExecutorPolicy.java:63)
        at org.gradle.internal.concurrent.ManagedExecutorImpl$1.run(ManagedExecutorImpl.java:46)
        at org.gradle.internal.concurrent.ThreadFactoryImpl$ManagedThreadRunnable.run(ThreadFactoryImpl.java:55)
Caused by: org.gradle.tooling.BuildException: Execution of compression failed.
        at com.android.build.gradle.internal.scope.BuildElements$ExecutorBasedScheduler$transform$2.invoke(BuildElements.kt:133)
        at com.android.build.gradle.internal.scope.BuildElements$ExecutorBasedScheduler$transform$2.invoke(BuildElements.kt:110)
        at kotlin.sequences.SequencesKt___SequencesKt$onEach$1.invoke(_Sequences.kt:1260)
        at kotlin.sequences.TransformingSequence$iterator$1.next(Sequences.kt:148)
        at kotlin.sequences.FilteringSequence$iterator$1.calcNext(Sequences.kt:108)
        at kotlin.sequences.FilteringSequence$iterator$1.hasNext(Sequences.kt:132)
        at kotlin.sequences.TransformingSequence$iterator$1.hasNext(Sequences.kt:152)
        at kotlin.sequences.SequencesKt___SequencesKt.toCollection(_Sequences.kt:633)
        at kotlin.sequences.SequencesKt___SequencesKt.toMutableList(_Sequences.kt:663)
        at kotlin.sequences.SequencesKt___SequencesKt.toList(_Sequences.kt:654)
        at com.android.build.gradle.internal.scope.BuildElements$ExecutorBasedScheduler.transform(BuildElements.kt:140)
        at com.android.build.gradle.internal.scope.BuildElements$ExecutorBasedScheduler.into(BuildElements.kt:115)
        at com.android.build.gradle.internal.scope.BuildElementActionScheduler.into(BuildElementActionScheduler.kt:32)
        at com.android.build.gradle.tasks.PackageAndroidArtifact.doFullTaskAction(PackageAndroidArtifact.java:393)
        at com.android.build.gradle.internal.tasks.IncrementalTask.taskAction(IncrementalTask.java:106)
        at org.gradle.internal.reflect.JavaMethod.invoke(JavaMethod.java:73)
        at org.gradle.api.internal.project.taskfactory.IncrementalTaskAction.doExecute(IncrementalTaskAction.java:46)
        at org.gradle.api.internal.project.taskfactory.StandardTaskAction.execute(StandardTaskAction.java:39)
        at org.gradle.api.internal.project.taskfactory.StandardTaskAction.execute(StandardTaskAction.java:26)
        at org.gradle.api.internal.tasks.execution.ExecuteActionsTaskExecuter$1.run(ExecuteActionsTaskExecuter.java:121)
        at org.gradle.internal.progress.DefaultBuildOperationExecutor$RunnableBuildOperationWorker.execute(DefaultBuildOperationExecutor.java:336)
        at org.gradle.internal.progress.DefaultBuildOperationExecutor$RunnableBuildOperationWorker.execute(DefaultBuildOperationExecutor.java:328)
        at org.gradle.internal.progress.DefaultBuildOperationExecutor.execute(DefaultBuildOperationExecutor.java:199)
        at org.gradle.internal.progress.DefaultBuildOperationExecutor.run(DefaultBuildOperationExecutor.java:110)
        at org.gradle.api.internal.tasks.execution.ExecuteActionsTaskExecuter.executeAction(ExecuteActionsTaskExecuter.java:110)
        at org.gradle.api.internal.tasks.execution.ExecuteActionsTaskExecuter.executeActions(ExecuteActionsTaskExecuter.java:92)
        ... 29 more
Caused by: java.io.IOException: Execution of compression failed.
        at com.android.apkzlib.zip.CentralDirectoryHeader.getCompressionInfoWithWait(CentralDirectoryHeader.java:431)
        at com.android.apkzlib.zip.ZFile.processAllReadyEntriesWithWait(ZFile.java:1844)
        at com.android.apkzlib.zip.ZFile.hasPendingChangesWithWait(ZFile.java:2748)
        at com.android.apkzlib.zfile.ApkZFileCreator.hasPendingChangesWithWait(ApkZFileCreator.java:180)
        at com.android.builder.internal.packaging.IncrementalPackager.hasPendingChangesWithWait(IncrementalPackager.java:319)
        at com.android.build.gradle.tasks.PackageAndroidArtifact.doTask(PackageAndroidArtifact.java:670)
        at com.android.build.gradle.tasks.PackageAndroidArtifact.splitFullAction(PackageAndroidArtifact.java:496)
        at com.android.build.gradle.tasks.PackageAndroidArtifact.lambda$doFullTaskAction$2(PackageAndroidArtifact.java:388)
        at com.android.build.gradle.internal.scope.BuildElements$ExecutorBasedScheduler$transform$$inlined$forEach$lambda$1.call(BuildElements.kt:121)
        at com.android.build.gradle.internal.scope.BuildElements$ExecutorBasedScheduler$transform$$inlined$forEach$lambda$1.call(BuildElements.kt:110)
        Suppressed: java.io.IOException: Failed to obtain compression information for entry
                at com.android.apkzlib.zip.ZFile.processAllReadyEntries(ZFile.java:1822)
                at com.android.apkzlib.zip.ZFile.processAllReadyEntriesWithWait(ZFile.java:1836)
                at com.android.apkzlib.zip.ZFile.update(ZFile.java:990)
                at com.android.apkzlib.zip.ZFile.close(ZFile.java:1283)
                at com.android.apkzlib.zfile.ApkZFileCreator.close(ApkZFileCreator.java:189)
                at com.google.common.io.Closer.close(Closer.java:216)
                at com.android.builder.internal.packaging.IncrementalPackager.close(IncrementalPackager.java:332)
                at com.android.build.gradle.tasks.PackageAndroidArtifact.doTask(PackageAndroidArtifact.java:676)
                at com.android.build.gradle.tasks.PackageAndroidArtifact.splitFullAction(PackageAndroidArtifact.java:496)
                at com.android.build.gradle.tasks.PackageAndroidArtifact.lambda$doFullTaskAction$2(PackageAndroidArtifact.java:388)
                at com.android.build.gradle.internal.scope.BuildElements$ExecutorBasedScheduler$transform$$inlined$forEach$lambda$1.call(BuildElements.kt:121)
                at com.android.build.gradle.internal.scope.BuildElements$ExecutorBasedScheduler$transform$$inlined$forEach$lambda$1.call(BuildElements.kt:110)
                at java.util.concurrent.ForkJoinTask$AdaptedCallable.exec(ForkJoinTask.java:1424)
                at java.util.concurrent.ForkJoinTask.doExec(ForkJoinTask.java:289)
                at java.util.concurrent.ForkJoinPool$WorkQueue.runTask(ForkJoinPool.java:1056)
                at java.util.concurrent.ForkJoinPool.runWorker(ForkJoinPool.java:1692)
                at java.util.concurrent.ForkJoinWorkerThread.run(ForkJoinWorkerThread.java:157)
        Caused by: java.util.concurrent.ExecutionException: java.lang.OutOfMemoryError: Java heap space
                at com.google.common.util.concurrent.AbstractFuture.getDoneValue(AbstractFuture.java:503)
                at com.google.common.util.concurrent.AbstractFuture.get(AbstractFuture.java:462)
                at com.google.common.util.concurrent.AbstractFuture$TrustedFuture.get(AbstractFuture.java:79)
                at com.android.apkzlib.zip.ZFile.processAllReadyEntries(ZFile.java:1817)
                ... 16 more
        Caused by: java.lang.OutOfMemoryError: Java heap space
                at com.android.apkzlib.zip.compress.DeflateExecutionCompressor.immediateCompress(DeflateExecutionCompressor.java:71)
                at com.android.apkzlib.zip.compress.BestAndDefaultDeflateExecutorCompressor.immediateCompress(BestAndDefaultDeflateExecutorCompressor.java:79)
                at com.android.apkzlib.zip.compress.ExecutorCompressor.lambda$compress$0(ExecutorCompressor.java:54)
                at com.android.apkzlib.zip.compress.ExecutorCompressor$$Lambda$415/826779488.run(Unknown Source)
Caused by: java.util.concurrent.ExecutionException: java.lang.OutOfMemoryError: Java heap space
        at com.google.common.util.concurrent.AbstractFuture.getDoneValue(AbstractFuture.java:503)
        at com.google.common.util.concurrent.AbstractFuture.get(AbstractFuture.java:482)
        at com.google.common.util.concurrent.AbstractFuture$TrustedFuture.get(AbstractFuture.java:79)
        at com.android.apkzlib.zip.CentralDirectoryHeader.getCompressionInfoWithWait(CentralDirectoryHeader.java:425)
        ... 9 more
        [CIRCULAR REFERENCE:java.lang.OutOfMemoryError: Java heap space]


* Get more help at https://help.gradle.org

BUILD FAILED in 31s
46 actionable tasks: 3 executed, 43 up-to-date




The build seems to have failed.



翻了些帖子修改了app-build.gradle和2份grable.properties
jdk也升级了最新版本

发表于 2020-3-18 20:30:14 | 显示全部楼层
减小游戏体积,压缩图片,视频,音频
回复 支持 反对

使用道具 举报

 楼主| 发表于 2020-3-19 09:30:14 | 显示全部楼层
小猪 发表于 2020-3-18 20:30
减小游戏体积,压缩图片,视频,音频

我本机32G内存 居然不能调用吗
回复 支持 反对

使用道具 举报

您需要登录后才可以回帖 登录 | 立即注册

本版积分规则

小黑屋|手机版|RenPy中文空间 ( 苏ICP备17067825号 | 苏公网安备 32092302000068号 )

GMT+8, 2020-9-22 13:20 , Processed in 0.046296 second(s), 27 queries , File On.

Powered by Discuz! X3.4 Licensed

© 2001-2017 Comsenz Inc.

快速回复 返回顶部 返回列表