RenPy中文空间

 找回密码
 立即注册

QQ登录

只需一步,快速开始

查看: 141|回复: 2

[求助] org.gradle.tooling.BuildException (no error message)

[复制链接]
发表于 2020-12-28 21:35:26 | 显示全部楼层 |阅读模式

马上注册,结交更多好友,享用更多功能,让你轻松玩转社区。

您需要 登录 才可以下载或查看,没有帐号?立即注册

x
Ren'Py 7.3.5.606

正在更新工程。

正在创建资源目录。

正在打包内部数据。

正在使用 Gradle 构建应用包。
Starting a Gradle Daemon, 1 stopped Daemon could not be reused, use --status for details
:app:preBuild UP-TO-DATE
:renpyandroid:preBuild UP-TO-DATE
:renpyandroid:preReleaseBuild UP-TO-DATE
:renpyandroid:checkReleaseManifest UP-TO-DATE
:renpyandroid:processReleaseManifest UP-TO-DATE
:app:preReleaseBuild UP-TO-DATE
:renpyandroid:compileReleaseAidl UP-TO-DATE
:app:compileReleaseAidl UP-TO-DATE
:renpyandroid:packageReleaseRenderscript NO-SOURCE
:app:compileReleaseRenderscript UP-TO-DATE
:app:checkReleaseManifest UP-TO-DATE
:app:generateReleaseBuildConfig UP-TO-DATE
:app:prepareLintJar UP-TO-DATE
:app:mainApkListPersistenceRelease
:app:generateReleaseResValues UP-TO-DATE
:app:generateReleaseResources UP-TO-DATE
:renpyandroid:compileReleaseRenderscript UP-TO-DATE
:renpyandroid:generateReleaseResValues UP-TO-DATE
:renpyandroid:generateReleaseResources UP-TO-DATE
:renpyandroid:packageReleaseResources UP-TO-DATE
:app:mergeReleaseResources
:app:createReleaseCompatibleScreenManifests
:app:processReleaseManifest
:app:splitsDiscoveryTaskRelease
:renpyandroid:platformAttrExtractor UP-TO-DATE
:renpyandroid:generateReleaseRFile UP-TO-DATE
:app:processReleaseResources
:app:generateReleaseSources
:renpyandroid:generateReleaseBuildConfig UP-TO-DATE
:renpyandroid:prepareLintJar UP-TO-DATE
:renpyandroid:generateReleaseSources UP-TO-DATE
:renpyandroid:javaPreCompileRelease UP-TO-DATE
:renpyandroid:compileReleaseJavaWithJavac UP-TO-DATE
:renpyandroid:processReleaseJavaRes NO-SOURCE
:renpyandroid:transformClassesAndResourcesWithPrepareIntermediateJarsForRelease UP-TO-DATE
:app:javaPreCompileRelease UP-TO-DATE
:app:compileReleaseJavaWithJavac UP-TO-DATE
:app:compileReleaseNdk NO-SOURCE
:app:compileReleaseSources UP-TO-DATE
:app:lintVitalRelease
:app:mergeReleaseShaders UP-TO-DATE
:app:compileReleaseShaders UP-TO-DATE
:app:generateReleaseAssets UP-TO-DATE
:renpyandroid:mergeReleaseShaders UP-TO-DATE
:renpyandroid:compileReleaseShaders UP-TO-DATE
:renpyandroid:generateReleaseAssets UP-TO-DATE
:renpyandroid:packageReleaseAssets UP-TO-DATE
:app:mergeReleaseAssets
:app:transformClassesWithDexBuilderForRelease UP-TO-DATE
:app:transformDexArchiveWithExternalLibsDexMergerForRelease UP-TO-DATE
:app:transformDexArchiveWithDexMergerForRelease UP-TO-DATE
:app:mergeReleaseJniLibFolders UP-TO-DATE
:renpyandroid:compileReleaseNdk NO-SOURCE
:renpyandroid:mergeReleaseJniLibFolders UP-TO-DATE
:renpyandroid:transformNativeLibsWithMergeJniLibsForRelease UP-TO-DATE
:renpyandroid:transformNativeLibsWithIntermediateJniLibsForRelease UP-TO-DATE
:app:transformNativeLibsWithMergeJniLibsForRelease UP-TO-DATE
:app:processReleaseJavaRes NO-SOURCE
:app:transformResourcesWithMergeJavaResForRelease UP-TO-DATE
:app:validateSigningRelease UP-TO-DATE
:app:packageRelease
Expiring Daemon because JVM Tenured space is exhausted
Daemon will be stopped at the end of the build after running out of JVM memory
:app:packageRelease FAILED

FAILURE: Build failed with an exception.

* What went wrong:
Execution failed for task ':app:packageRelease'.
> org.gradle.tooling.BuildException (no error message)

* Try:
Run with --info or --debug option to get more log output. Run with --scan to get full insights.

* Exception is:
org.gradle.api.tasks.TaskExecutionException: Execution failed for task ':app:packageRelease'.
        at org.gradle.api.internal.tasks.execution.ExecuteActionsTaskExecuter.executeActions(ExecuteActionsTaskExecuter.java:100)
        at org.gradle.api.internal.tasks.execution.ExecuteActionsTaskExecuter.execute(ExecuteActionsTaskExecuter.java:70)
        at org.gradle.api.internal.tasks.execution.OutputDirectoryCreatingTaskExecuter.execute(OutputDirectoryCreatingTaskExecuter.java:51)
        at org.gradle.api.internal.tasks.execution.SkipUpToDateTaskExecuter.execute(SkipUpToDateTaskExecuter.java:62)
        at org.gradle.api.internal.tasks.execution.ResolveTaskOutputCachingStateExecuter.execute(ResolveTaskOutputCachingStateExecuter.java:54)
        at org.gradle.api.internal.tasks.execution.ValidatingTaskExecuter.execute(ValidatingTaskExecuter.java:60)
        at org.gradle.api.internal.tasks.execution.SkipEmptySourceFilesTaskExecuter.execute(SkipEmptySourceFilesTaskExecuter.java:97)
        at org.gradle.api.internal.tasks.execution.CleanupStaleOutputsExecuter.execute(CleanupStaleOutputsExecuter.java:87)
        at org.gradle.api.internal.tasks.execution.ResolveTaskArtifactStateTaskExecuter.execute(ResolveTaskArtifactStateTaskExecuter.java:52)
        at org.gradle.api.internal.tasks.execution.SkipTaskWithNoActionsExecuter.execute(SkipTaskWithNoActionsExecuter.java:52)
        at org.gradle.api.internal.tasks.execution.SkipOnlyIfTaskExecuter.execute(SkipOnlyIfTaskExecuter.java:54)
        at org.gradle.api.internal.tasks.execution.ExecuteAtMostOnceTaskExecuter.execute(ExecuteAtMostOnceTaskExecuter.java:43)
        at org.gradle.api.internal.tasks.execution.CatchExceptionTaskExecuter.execute(CatchExceptionTaskExecuter.java:34)
        at org.gradle.execution.taskgraph.DefaultTaskGraphExecuter$EventFiringTaskWorker$1.run(DefaultTaskGraphExecuter.java:248)
        at org.gradle.internal.progress.DefaultBuildOperationExecutor$RunnableBuildOperationWorker.execute(DefaultBuildOperationExecutor.java:336)
        at org.gradle.internal.progress.DefaultBuildOperationExecutor$RunnableBuildOperationWorker.execute(DefaultBuildOperationExecutor.java:328)
        at org.gradle.internal.progress.DefaultBuildOperationExecutor.execute(DefaultBuildOperationExecutor.java:199)
        at org.gradle.internal.progress.DefaultBuildOperationExecutor.run(DefaultBuildOperationExecutor.java:110)
        at org.gradle.execution.taskgraph.DefaultTaskGraphExecuter$EventFiringTaskWorker.execute(DefaultTaskGraphExecuter.java:241)
        at org.gradle.execution.taskgraph.DefaultTaskGraphExecuter$EventFiringTaskWorker.execute(DefaultTaskGraphExecuter.java:230)
        at org.gradle.execution.taskgraph.DefaultTaskPlanExecutor$TaskExecutorWorker.processTask(DefaultTaskPlanExecutor.java:123)
        at org.gradle.execution.taskgraph.DefaultTaskPlanExecutor$TaskExecutorWorker.access$200(DefaultTaskPlanExecutor.java:79)
        at org.gradle.execution.taskgraph.DefaultTaskPlanExecutor$TaskExecutorWorker$1.execute(DefaultTaskPlanExecutor.java:104)
        at org.gradle.execution.taskgraph.DefaultTaskPlanExecutor$TaskExecutorWorker$1.execute(DefaultTaskPlanExecutor.java:98)
        at org.gradle.execution.taskgraph.DefaultTaskExecutionPlan.execute(DefaultTaskExecutionPlan.java:626)
        at org.gradle.execution.taskgraph.DefaultTaskExecutionPlan.executeWithTask(DefaultTaskExecutionPlan.java:581)
        at org.gradle.execution.taskgraph.DefaultTaskPlanExecutor$TaskExecutorWorker.run(DefaultTaskPlanExecutor.java:98)
        at org.gradle.internal.concurrent.ExecutorPolicy$CatchAndRecordFailures.onExecute(ExecutorPolicy.java:63)
        at org.gradle.internal.concurrent.ManagedExecutorImpl$1.run(ManagedExecutorImpl.java:46)
        at org.gradle.internal.concurrent.ThreadFactoryImpl$ManagedThreadRunnable.run(ThreadFactoryImpl.java:55)
Caused by: org.gradle.tooling.BuildException
        at com.android.build.gradle.internal.scope.BuildElements$ExecutorBasedScheduler$transform$2.invoke(BuildElements.kt:133)
        at com.android.build.gradle.internal.scope.BuildElements$ExecutorBasedScheduler$transform$2.invoke(BuildElements.kt:110)
        at kotlin.sequences.SequencesKt___SequencesKt$onEach$1.invoke(_Sequences.kt:1260)
        at kotlin.sequences.TransformingSequence$iterator$1.next(Sequences.kt:148)
        at kotlin.sequences.FilteringSequence$iterator$1.calcNext(Sequences.kt:108)
        at kotlin.sequences.FilteringSequence$iterator$1.hasNext(Sequences.kt:132)
        at kotlin.sequences.TransformingSequence$iterator$1.hasNext(Sequences.kt:152)
        at kotlin.sequences.SequencesKt___SequencesKt.toCollection(_Sequences.kt:633)
        at kotlin.sequences.SequencesKt___SequencesKt.toMutableList(_Sequences.kt:663)
        at kotlin.sequences.SequencesKt___SequencesKt.toList(_Sequences.kt:654)
        at com.android.build.gradle.internal.scope.BuildElements$ExecutorBasedScheduler.transform(BuildElements.kt:140)
        at com.android.build.gradle.internal.scope.BuildElements$ExecutorBasedScheduler.into(BuildElements.kt:115)
        at com.android.build.gradle.internal.scope.BuildElementActionScheduler.into(BuildElementActionScheduler.kt:32)
        at com.android.build.gradle.tasks.PackageAndroidArtifact.doFullTaskAction(PackageAndroidArtifact.java:393)
        at com.android.build.gradle.internal.tasks.IncrementalTask.taskAction(IncrementalTask.java:106)
        at org.gradle.internal.reflect.JavaMethod.invoke(JavaMethod.java:73)
        at org.gradle.api.internal.project.taskfactory.IncrementalTaskAction.doExecute(IncrementalTaskAction.java:46)
        at org.gradle.api.internal.project.taskfactory.StandardTaskAction.execute(StandardTaskAction.java:39)
        at org.gradle.api.internal.project.taskfactory.StandardTaskAction.execute(StandardTaskAction.java:26)
        at org.gradle.api.internal.tasks.execution.ExecuteActionsTaskExecuter$1.run(ExecuteActionsTaskExecuter.java:121)
        at org.gradle.internal.progress.DefaultBuildOperationExecutor$RunnableBuildOperationWorker.execute(DefaultBuildOperationExecutor.java:336)
        at org.gradle.internal.progress.DefaultBuildOperationExecutor$RunnableBuildOperationWorker.execute(DefaultBuildOperationExecutor.java:328)
        at org.gradle.internal.progress.DefaultBuildOperationExecutor.execute(DefaultBuildOperationExecutor.java:199)
        at org.gradle.internal.progress.DefaultBuildOperationExecutor.run(DefaultBuildOperationExecutor.java:110)
        at org.gradle.api.internal.tasks.execution.ExecuteActionsTaskExecuter.executeAction(ExecuteActionsTaskExecuter.java:110)
        at org.gradle.api.internal.tasks.execution.ExecuteActionsTaskExecuter.executeActions(ExecuteActionsTaskExecuter.java:92)
        ... 29 more
Caused by: java.lang.OutOfMemoryError
        at com.android.ide.common.internal.WaitableExecutor.waitForAllTasks(WaitableExecutor.java:215)
        at com.android.build.gradle.internal.scope.BuildElements$ExecutorBasedScheduler.transform(BuildElements.kt:125)
        ... 44 more
Caused by: java.lang.OutOfMemoryError: Java heap space


* Get more help at https://help.gradle.org

BUILD FAILED in 25s
46 actionable tasks: 9 executed, 37 up-to-date
Expiring Daemon because JVM Tenured space is exhausted




构建似乎已失败。
 楼主| 发表于 2020-12-28 21:36:01 | 显示全部楼层
请问一下这是什么错误啊, (no error message)
回复 支持 反对

使用道具 举报

发表于 2021-1-9 13:55:08 | 显示全部楼层
是说内存溢出了
回复 支持 反对

使用道具 举报

您需要登录后才可以回帖 登录 | 立即注册

本版积分规则

小黑屋|手机版|RenPy中文空间 ( 苏ICP备17067825号 | 苏公网安备 32092302000068号 )

GMT+8, 2021-1-26 13:17 , Processed in 0.030923 second(s), 11 queries , File On.

Powered by Discuz! X3.4 Licensed

Copyright © 2001-2020, Tencent Cloud.

快速回复 返回顶部 返回列表